Target
Gamma-aminobutyric acid receptor subunit alpha-1
Ligand
BDBM50244260
Substrate
Meas. Tech.
ChEMBL_491431 (CHEMBL948526)
Ki
2050±n/a nM
Citation
 Harris, DClayton, TCook, JSahbaie, PHalliwell, RFFurtmüller, RHuck, SSieghart, WDeLorey, TM Selective influence on contextual memory: physiochemical properties associated with selectivity of benzodiazepine ligands at GABAA receptors containing the alpha5 subunit. J Med Chem 51:3788-803 (2008)  
Target
Name:
Gamma-aminobutyric acid receptor subunit alpha-1
Synonyms:
Benzodiazepine central GABA A Benzodiazepine liver GABA(A) receptor subunit alpha-1 GABA-A receptor GBRA1_HUMAN TBPS | agonist GABA site
Type:
Protein
Mol. Mass.:
51817.35
Organism:
Homo sapiens (Human)
Description:
P14867
Residue:
456
  
Inhibitor
Name:
BDBM50244260
Synonyms:
7-chloro-4-methyl-3-pentylimidazo[1,5-a]quinazolin-5(4H)-one | CHEMBL471115
Type:
Small organic molecule
Emp. Form.:
C16H18ClN3O
Mol. Mass.:
303.787
SMILES:
CCCCCc1ncn2c1n(C)c(=O)c1cc(Cl)ccc21
: