Target
Gamma-aminobutyric acid receptor subunit alpha-6
Ligand
BDBM50244262
Substrate
Meas. Tech.
ChEMBL_491125 (CHEMBL991893)
Ki
>100±n/a nM
Citation
 Harris, DClayton, TCook, JSahbaie, PHalliwell, RFFurtmüller, RHuck, SSieghart, WDeLorey, TM Selective influence on contextual memory: physiochemical properties associated with selectivity of benzodiazepine ligands at GABAA receptors containing the alpha5 subunit. J Med Chem 51:3788-803 (2008)  
Target
Name:
Gamma-aminobutyric acid receptor subunit alpha-6
Synonyms:
GABA A alpha6 GABRA6 | GBRA6_HUMAN
Type:
Enzyme Catalytic Domain
Mol. Mass.:
51029.60
Organism:
Homo sapiens (Human)
Description:
GABA A alpha6 0 HUMAN::Q16445
Residue:
453
  
Inhibitor
Name:
BDBM50244262
Synonyms:
CHEMBL471978 | ethyl 7-ethynyl-4-methyl-5-oxo-4,5-dihydroimidazo[1,5-a]quinazoline-3-carboxylate
Type:
Small organic molecule
Emp. Form.:
C16H13N3O3
Mol. Mass.:
295.2927
SMILES:
CCOC(=O)c1ncn2c1n(C)c(=O)c1cc(ccc21)C#C
: