Target
Gamma-aminobutyric acid receptor subunit alpha-1
Ligand
BDBM50244196
Substrate
Meas. Tech.
ChEMBL_491431 (CHEMBL948526)
Ki
500±n/a nM
Citation
 Harris, DClayton, TCook, JSahbaie, PHalliwell, RFFurtmüller, RHuck, SSieghart, WDeLorey, TM Selective influence on contextual memory: physiochemical properties associated with selectivity of benzodiazepine ligands at GABAA receptors containing the alpha5 subunit. J Med Chem 51:3788-803 (2008)  
Target
Name:
Gamma-aminobutyric acid receptor subunit alpha-1
Synonyms:
Benzodiazepine central GABA A Benzodiazepine liver GABA(A) receptor subunit alpha-1 GABA-A receptor GBRA1_HUMAN TBPS | agonist GABA site
Type:
Protein
Mol. Mass.:
51817.35
Organism:
Homo sapiens (Human)
Description:
P14867
Residue:
456
  
Inhibitor
Name:
BDBM50244196
Synonyms:
7-chloro-3-(ethoxymethyl)-4-methylimidazo[1,5-a]quinazolin-5(4H)-one PWZ-35A
Type:
Small organic molecule
Emp. Form.:
C14H14ClN3O2
Mol. Mass.:
291.733
SMILES:
CCOCc1ncn2c1n(C)c(=O)c1cc(Cl)ccc21
: