Target
Gamma-aminobutyric acid receptor subunit alpha-5
Ligand
BDBM50244263
Substrate
Meas. Tech.
ChEMBL_491432 (CHEMBL948527)
Ki
15±n/a nM
Citation
 Harris, DClayton, TCook, JSahbaie, PHalliwell, RFFurtmüller, RHuck, SSieghart, WDeLorey, TM Selective influence on contextual memory: physiochemical properties associated with selectivity of benzodiazepine ligands at GABAA receptors containing the alpha5 subunit. J Med Chem 51:3788-803 (2008)  
Target
Name:
Gamma-aminobutyric acid receptor subunit alpha-5
Synonyms:
GABA receptor alpha-5 subunit GABRA5 Gamma-aminobutyric acid receptor subunit alpha-5 (GABA(A)) | Gamma-aminobutyric acid receptor subunit alpha-5 (GABAA)
Type:
Enzyme
Mol. Mass.:
52160.59
Organism:
Homo sapiens (Human)
Description:
P31644
Residue:
462
  
Inhibitor
Name:
BDBM50244263
Synonyms:
7-ethynyl-4-methyl-5-oxo-4,5-dihydroimidazo[1,5-a]quinazolin-3-yl 7-ethynyl-4-methyl-5-oxo-4,5-dihydroimidazo[1,5-a]quinazoline-3-carboxylate | CHEMBL394710
Type:
Small organic molecule
Emp. Form.:
C30H20N6O6
Mol. Mass.:
560.5164
SMILES:
Cn1c2c(ncn2c2ccc(cc2c1=O)C#C)C(=O)OCCOC(=O)c1ncn2c1n(C)c(=O)c1cc(ccc21)C#C
: