Target
Gamma-aminobutyric acid receptor subunit alpha-5
Ligand
BDBM50244037
Substrate
Meas. Tech.
ChEMBL_491119 (CHEMBL991887)
Kd
591±n/a nM
Citation
 Harris, DClayton, TCook, JSahbaie, PHalliwell, RFFurtmüller, RHuck, SSieghart, WDeLorey, TM Selective influence on contextual memory: physiochemical properties associated with selectivity of benzodiazepine ligands at GABAA receptors containing the alpha5 subunit. J Med Chem 51:3788-803 (2008)  
Target
Name:
Gamma-aminobutyric acid receptor subunit alpha-5
Synonyms:
GABA receptor alpha-5 subunit GABRA5 Gamma-aminobutyric acid receptor subunit alpha-5 (GABA(A)) | Gamma-aminobutyric acid receptor subunit alpha-5 (GABAA)
Type:
Enzyme
Mol. Mass.:
52160.59
Organism:
Homo sapiens (Human)
Description:
P31644
Residue:
462
  
Inhibitor
Name:
BDBM50244037
Synonyms:
3-propoxy-9H-pyrido[3,4-b]indole | CHEMBL499814
Type:
Small organic molecule
Emp. Form.:
C14H14N2O
Mol. Mass.:
226.2738
SMILES:
CCCOc1cc2c(cn1)[nH]c1ccccc21
: