Target
Gamma-aminobutyric acid receptor subunit alpha-1
Ligand
BDBM50244157
Substrate
Meas. Tech.
ChEMBL_491120 (CHEMBL991888)
IC50
470±n/a nM
Citation
 Harris, DClayton, TCook, JSahbaie, PHalliwell, RFFurtmüller, RHuck, SSieghart, WDeLorey, TM Selective influence on contextual memory: physiochemical properties associated with selectivity of benzodiazepine ligands at GABAA receptors containing the alpha5 subunit. J Med Chem 51:3788-803 (2008)  
Target
Name:
Gamma-aminobutyric acid receptor subunit alpha-1
Synonyms:
Benzodiazepine central GABA A Benzodiazepine liver GABA(A) receptor subunit alpha-1 GABA-A receptor GBRA1_HUMAN TBPS | agonist GABA site
Type:
Protein
Mol. Mass.:
51817.35
Organism:
Homo sapiens (Human)
Description:
P14867
Residue:
456
  
Inhibitor
Name:
BDBM50244157
Synonyms:
CHEMBL458317 | N-(4-chlorophenyl)-5-(2-(methylthio)pyrimidin-4-yl)thiophene-2-sulfonamide
Type:
Small organic molecule
Emp. Form.:
C15H12ClN3O2S3
Mol. Mass.:
397.923
SMILES:
CSc1nccc(n1)-c1ccc(s1)S(=O)(=O)Nc1ccc(Cl)cc1
: