Target
Gamma-aminobutyric acid receptor subunit alpha-5
Ligand
BDBM50244260
Substrate
Meas. Tech.
ChEMBL_491119 (CHEMBL991887)
Ki
369±n/a nM
Citation
 Harris, DClayton, TCook, JSahbaie, PHalliwell, RFFurtmüller, RHuck, SSieghart, WDeLorey, TM Selective influence on contextual memory: physiochemical properties associated with selectivity of benzodiazepine ligands at GABAA receptors containing the alpha5 subunit. J Med Chem 51:3788-803 (2008)  
Target
Name:
Gamma-aminobutyric acid receptor subunit alpha-5
Synonyms:
GABA receptor alpha-5 subunit GABRA5 Gamma-aminobutyric acid receptor subunit alpha-5 (GABA(A)) | Gamma-aminobutyric acid receptor subunit alpha-5 (GABAA)
Type:
Enzyme
Mol. Mass.:
52160.59
Organism:
Homo sapiens (Human)
Description:
P31644
Residue:
462
  
Inhibitor
Name:
BDBM50244260
Synonyms:
7-chloro-4-methyl-3-pentylimidazo[1,5-a]quinazolin-5(4H)-one | CHEMBL471115
Type:
Small organic molecule
Emp. Form.:
C16H18ClN3O
Mol. Mass.:
303.787
SMILES:
CCCCCc1ncn2c1n(C)c(=O)c1cc(Cl)ccc21
: