Target
Gamma-aminobutyric acid receptor subunit alpha-5
Ligand
BDBM50244232
Substrate
Meas. Tech.
ChEMBL_491119 (CHEMBL991887)
Ki
182±n/a nM
Citation
 Harris, DClayton, TCook, JSahbaie, PHalliwell, RFFurtmüller, RHuck, SSieghart, WDeLorey, TM Selective influence on contextual memory: physiochemical properties associated with selectivity of benzodiazepine ligands at GABAA receptors containing the alpha5 subunit. J Med Chem 51:3788-803 (2008)  
Target
Name:
Gamma-aminobutyric acid receptor subunit alpha-5
Synonyms:
GABA receptor alpha-5 subunit GABRA5 Gamma-aminobutyric acid receptor subunit alpha-5 (GABA(A)) | Gamma-aminobutyric acid receptor subunit alpha-5 (GABAA)
Type:
Enzyme
Mol. Mass.:
52160.59
Organism:
Homo sapiens (Human)
Description:
P31644
Residue:
462
  
Inhibitor
Name:
BDBM50244232
Synonyms:
7-chloro-3-ethyl-4-methylimidazo[1,5-a]quinazolin-5(4H)-one | CHEMBL458321
Type:
Small organic molecule
Emp. Form.:
C13H12ClN3O
Mol. Mass.:
261.707
SMILES:
CCc1ncn2c1n(C)c(=O)c1cc(Cl)ccc21
: