Target
Somatostatin receptor type 3
Ligand
BDBM50243570
Substrate
Meas. Tech.
ChEMBL_491202 (CHEMBL992798)
IC50
661±n/a nM
Citation
 Cescato, RErchegyi, JWaser, BPiccand, VMaecke, HRRivier, JEReubi, JC Design and in vitro characterization of highly sst2-selective somatostatin antagonists suitable for radiotargeting. J Med Chem 51:4030-7 (2008)  
Target
Name:
Somatostatin receptor type 3
Synonyms:
SOMATOSTATIN SST3 SS3-R SSR-28 SSTR3 | Somatostatin receptor type 3 (SSTR3)
Type:
Protein
Mol. Mass.:
45855.97
Organism:
Homo sapiens (Human)
Description:
P32745
Residue:
418
  
Inhibitor
Name:
BDBM50243570
Synonyms:
2-[(2R)-2-{[(4R,7S,10S,13R,16S,19S)-19-[(2R)-2-amino-3-(4-chlorophenyl)propanamido]-10-(4-aminobutyl)-16-{[4-(carbamoylamino)phenyl]methyl}-7-[(1R)-1-hydroxyethyl]-13-(1H-indol-3-ylmethyl)-6,9,12,15,18-pentaoxo-1,2-dithia-5,8,11,14,17-pentaazacycloicosan-4-yl]formamido}-3-[4-(carbamoylamino)phenyl]propanamido]acetic acid | CHEMBL447177
Type:
Small organic molecule
Emp. Form.:
C58H72ClN15O13S2
Mol. Mass.:
1286.868
SMILES:
C[C@@H](O)[C@@H]1NC(=O)[C@H](CCCCN)NC(=O)[C@@H](Cc2c[nH]c3ccccc23)NC(=O)[C@H](Cc2ccc(NC(N)=O)cc2)NC(=O)[C@@H](CSSC[C@H](NC1=O)C(=O)N[C@H](Cc1ccc(NC(N)=O)cc1)C(=O)NCC(O)=O)NC(=O)[C@H](N)Cc1ccc(Cl)cc1
: