Target
Cytochrome P450 2C19
Ligand
BDBM50264212
Substrate
Meas. Tech.
ChEMBL_535293 (CHEMBL982618)
IC50
>40000±n/a nM
Citation
 Sato, IMorihira, KInami, HKubota, HMorokata, TSuzuki, KIura, YNitta, AImaoka, TTakahashi, TTakeuchi, MOhta, MTsukamoto, S Design and synthesis of 6-fluoro-2-naphthyl derivatives as novel CCR3 antagonists with reduced CYP2D6 inhibition. Bioorg Med Chem 16:8607-18 (2008)  
Target
Name:
Cytochrome P450 2C19
Synonyms:
(R)-limonene 6-monooxygenase (S)-limonene 7-monooxygenase CYP2C19 CYPIIC19 Cytochrome P450 2C19 [I331V] Cytochrome P450-254C Mephenytoin 4-hydroxylase P450-254C
Type:
Enzyme
Mol. Mass.:
55935.47
Organism:
Homo sapiens (Human)
Description:
P33261
Residue:
490
  
Inhibitor
Name:
BDBM50264212
Synonyms:
CHEMBL519042 | N-{(3-exo)-8-[(6-Fluoro-2-naphthyl)methyl]-8-azabicyclo[3.2.1]oct-3-yl}-3-(piperidin-1-ylcarbonyl)isonicotinamide 1-oxide
Type:
Small organic molecule
Emp. Form.:
C30H33FN4O3
Mol. Mass.:
516.6064
SMILES:
[O-][n+]1ccc(C(=O)NC2C[C@H]3CC[C@H](C2)N3Cc2ccc3cc(F)ccc3c2)c(c1)C(=O)N1CCCCC1
: