Target
Cytochrome P450 3A4
Ligand
BDBM50264212
Substrate
Meas. Tech.
ChEMBL_535294 (CHEMBL982619)
IC50
>40000±n/a nM
Citation
 Sato, IMorihira, KInami, HKubota, HMorokata, TSuzuki, KIura, YNitta, AImaoka, TTakahashi, TTakeuchi, MOhta, MTsukamoto, S Design and synthesis of 6-fluoro-2-naphthyl derivatives as novel CCR3 antagonists with reduced CYP2D6 inhibition. Bioorg Med Chem 16:8607-18 (2008)  
Target
Name:
Cytochrome P450 3A4
Synonyms:
Albendazole monooxygenase CP3A4_HUMAN CYP3A4 CYPIIIA4 Cytochrome P450 3A4 (CYP3A4) Nifedipine oxidase Taurochenodeoxycholate 6-alpha-hydroxylase
Type:
Enzyme
Mol. Mass.:
57349.57
Organism:
Homo sapiens (Human)
Description:
Residue:
503
  
Inhibitor
Name:
BDBM50264212
Synonyms:
CHEMBL519042 | N-{(3-exo)-8-[(6-Fluoro-2-naphthyl)methyl]-8-azabicyclo[3.2.1]oct-3-yl}-3-(piperidin-1-ylcarbonyl)isonicotinamide 1-oxide
Type:
Small organic molecule
Emp. Form.:
C30H33FN4O3
Mol. Mass.:
516.6064
SMILES:
[O-][n+]1ccc(C(=O)NC2C[C@H]3CC[C@H](C2)N3Cc2ccc3cc(F)ccc3c2)c(c1)C(=O)N1CCCCC1
: