Target
4-hydroxy-tetrahydrodipicolinate synthase
Ligand
BDBM50160721
Substrate
Meas. Tech.
ChEMBL_536820 (CHEMBL988084)
Ki
170000±n/a nM
Citation
 Boughton, BAGriffin, MDO'Donnell, PADobson, RCPerugini, MAGerrard, JAHutton, CA Irreversible inhibition of dihydrodipicolinate synthase by 4-oxo-heptenedioic acid analogues. Bioorg Med Chem 16:9975-83 (2008)  
Target
Name:
4-hydroxy-tetrahydrodipicolinate synthase
Synonyms:
DAPA_ECOLI dapA
Type:
PROTEIN
Mol. Mass.:
31269.12
Organism:
Escherichia coli (strain K12)
Description:
ChEMBL_536816
Residue:
292
  
Inhibitor
Name:
BDBM50160721
Synonyms:
2-Oxo-heptanedioic acid CHEMBL185075 | alpha-ketopimelic acid
Type:
Small organic molecule
Emp. Form.:
C7H10O5
Mol. Mass.:
174.1513
SMILES:
OC(=O)CCCCC(=O)C(O)=O
: