Target
4-hydroxy-tetrahydrodipicolinate synthase
Ligand
BDBM50273975
Substrate
Meas. Tech.
ChEMBL_536820 (CHEMBL988084)
Ki
830000±n/a nM
Citation
 Boughton, BAGriffin, MDO'Donnell, PADobson, RCPerugini, MAGerrard, JAHutton, CA Irreversible inhibition of dihydrodipicolinate synthase by 4-oxo-heptenedioic acid analogues. Bioorg Med Chem 16:9975-83 (2008)  
Target
Name:
4-hydroxy-tetrahydrodipicolinate synthase
Synonyms:
DAPA_ECOLI dapA
Type:
PROTEIN
Mol. Mass.:
31269.12
Organism:
Escherichia coli (strain K12)
Description:
ChEMBL_536816
Residue:
292
  
Inhibitor
Name:
BDBM50273975
Synonyms:
2-ketobutyrate 2-oxobutanoate alpha-oxobutyrate
Type:
Small organic molecule
Emp. Form.:
C4H5O3
Mol. Mass.:
101.0812
SMILES:
CCC(=O)C([O-])=O
: