Target
Prostaglandin G/H synthase 2
Ligand
BDBM50253879
Substrate
Meas. Tech.
ChEMBL_561220 (CHEMBL1012766)
IC50
>10±n/a nM
Citation
 Koeberle, AZettl, HGreiner, CWurglics, MSchubert-Zsilavecz, MWerz, O Pirinixic acid derivatives as novel dual inhibitors of microsomal prostaglandin E2 synthase-1 and 5-lipoxygenase. J Med Chem 51:8068-76 (2008)  
Target
Name:
Prostaglandin G/H synthase 2
Synonyms:
COX2 Cyclooxygenase 2 (COX-2) Cyclooxygenase-2 (COX-2 AA) Cyclooxygenase-2 (COX-2) PGH2_HUMAN PHS II Prostaglandin E synthase/G/H synthase 2 Prostaglandin-endoperoxide synthase 2
Type:
Enzyme
Mol. Mass.:
69003.89
Organism:
Homo sapiens (Human)
Description:
Recombinant Cox-2 provided by Cayman (Cayman Chemical Co.,Ann Arbor, MI).
Residue:
604
  
Inhibitor
Name:
BDBM50253879
Synonyms:
CHEMBL459720 | ethyl 2-(4-chloro-6-(2,3-dimethylphenylamino)pyrimidin-2-ylthio)octanoate
Type:
Small organic molecule
Emp. Form.:
C22H30ClN3O2S
Mol. Mass.:
436.011
SMILES:
CCCCCCC(Sc1nc(Cl)cc(Nc2cccc(C)c2C)n1)C(=O)OCC
: