Target
cAMP-specific 3',5'-cyclic phosphodiesterase 4D
Ligand
BDBM50254829
Substrate
Meas. Tech.
ChEMBL_560773 (CHEMBL1011740)
IC50
253±n/a nM
Citation
 Cashman, JRVoelker, TJohnson, RJanowsky, A Stereoselective inhibition of serotonin re-uptake and phosphodiesterase by dual inhibitors as potential agents for depression. Bioorg Med Chem 17:337-43 (2008)  
Target
Name:
cAMP-specific 3',5'-cyclic phosphodiesterase 4D
Synonyms:
3',5'-cyclic phosphodiesterase PDE43 PDE4D_HUMAN | Phosphodiesterase 4D
Type:
Protein
Mol. Mass.:
91092.69
Organism:
Homo sapiens (Human)
Description:
Q08499
Residue:
809
  
Inhibitor
Name:
BDBM50254829
Synonyms:
4-(3,4-dimethoxyphenyl)-2-(5-((S)-3-phenyl-3-(4-(trifluoromethyl)phenoxy)propylamino)pentyl)-4a,5,8,8a-tetrahydrophthalazin-1(2H)-one | CHEMBL454507
Type:
Small organic molecule
Emp. Form.:
C37H42F3N3O4
Mol. Mass.:
649.7423
SMILES:
COc1ccc(cc1OC)C1=NN(CCCCCNCC[C@H](Oc2ccc(cc2)C(F)(F)F)c2ccccc2)C(=O)C2CC=CCC12
: