Target
Transporter
Ligand
BDBM50366567
Substrate
Meas. Tech.
ChEMBL_559243 (CHEMBL1014662)
Ki
4±n/a nM
Citation
 Manning, JRSexton, TChilders, SRDavies, HM 1-Naphthyl and 4-indolyl arylalkylamines as selective monoamine reuptake inhibitors. Bioorg Med Chem Lett 19:58-61 (2008)  
Target
Name:
Transporter
Synonyms:
NE transporter Norepinephrine transporter(NET)
Type:
Multi-pass membrane protein
Mol. Mass.:
69236.90
Organism:
Rattus norvegicus (rat)
Description:
Q63380
Residue:
617
  
Inhibitor
Name:
BDBM50366567
Synonyms:
ATOMOXETINE
Type:
Small organic molecule
Emp. Form.:
C17H21NO
Mol. Mass.:
255.3547
SMILES:
CNCC[C@@H](Oc1ccccc1C)c1ccccc1
: