Target
Transporter
Ligand
BDBM50254047
Substrate
Meas. Tech.
ChEMBL_559243 (CHEMBL1014662)
Ki
52.1±n/a nM
Citation
 Manning, JRSexton, TChilders, SRDavies, HM 1-Naphthyl and 4-indolyl arylalkylamines as selective monoamine reuptake inhibitors. Bioorg Med Chem Lett 19:58-61 (2008)  
Target
Name:
Transporter
Synonyms:
NE transporter Norepinephrine transporter(NET)
Type:
Multi-pass membrane protein
Mol. Mass.:
69236.90
Organism:
Rattus norvegicus (rat)
Description:
Q63380
Residue:
617
  
Inhibitor
Name:
BDBM50254047
Synonyms:
(S)-N-methyl-3-(naphthalen-1-yl)-3-(thiophen-2-yl)propan-1-amine hydrochloride | CHEMBL450173
Type:
Small organic molecule
Emp. Form.:
C18H19NS
Mol. Mass.:
281.415
SMILES:
CNCC[C@H](c1cccs1)c1cccc2ccccc12
: