Target
Transporter
Ligand
BDBM50254048
Substrate
Meas. Tech.
ChEMBL_559243 (CHEMBL1014662)
Ki
109±n/a nM
Citation
 Manning, JRSexton, TChilders, SRDavies, HM 1-Naphthyl and 4-indolyl arylalkylamines as selective monoamine reuptake inhibitors. Bioorg Med Chem Lett 19:58-61 (2008)  
Target
Name:
Transporter
Synonyms:
NE transporter Norepinephrine transporter(NET)
Type:
Multi-pass membrane protein
Mol. Mass.:
69236.90
Organism:
Rattus norvegicus (rat)
Description:
Q63380
Residue:
617
  
Inhibitor
Name:
BDBM50254048
Synonyms:
(R)-N-methyl-4-(naphthalen-1-yl)-4-(thiophen-2-yl)butan-1-amine hydrochloride | CHEMBL459519
Type:
Small organic molecule
Emp. Form.:
C19H21NS
Mol. Mass.:
295.442
SMILES:
CNCCC[C@@H](c1cccs1)c1cccc2ccccc12
: