Target
Transporter
Ligand
BDBM50254071
Substrate
Meas. Tech.
ChEMBL_559243 (CHEMBL1014662)
Ki
13.8±n/a nM
Citation
 Manning, JRSexton, TChilders, SRDavies, HM 1-Naphthyl and 4-indolyl arylalkylamines as selective monoamine reuptake inhibitors. Bioorg Med Chem Lett 19:58-61 (2008)  
Target
Name:
Transporter
Synonyms:
NE transporter Norepinephrine transporter(NET)
Type:
Multi-pass membrane protein
Mol. Mass.:
69236.90
Organism:
Rattus norvegicus (rat)
Description:
Q63380
Residue:
617
  
Inhibitor
Name:
BDBM50254071
Synonyms:
(S)-3-(1H-indol-4-yl)-N-methyl-3-(thiophen-2-yl)propan-1-amine hydrochloride | CHEMBL468914
Type:
Small organic molecule
Emp. Form.:
C16H18N2S
Mol. Mass.:
270.393
SMILES:
CNCC[C@H](c1cccs1)c1cccc2[nH]ccc12
: