Target
Transporter
Ligand
BDBM50254073
Substrate
Meas. Tech.
ChEMBL_559243 (CHEMBL1014662)
Ki
9±n/a nM
Citation
 Manning, JRSexton, TChilders, SRDavies, HM 1-Naphthyl and 4-indolyl arylalkylamines as selective monoamine reuptake inhibitors. Bioorg Med Chem Lett 19:58-61 (2008)  
Target
Name:
Transporter
Synonyms:
NE transporter Norepinephrine transporter(NET)
Type:
Multi-pass membrane protein
Mol. Mass.:
69236.90
Organism:
Rattus norvegicus (rat)
Description:
Q63380
Residue:
617
  
Inhibitor
Name:
BDBM50254073
Synonyms:
(S)-4-(1H-indol-4-yl)-N-methyl-4-(thiophen-2-yl)butan-1-amine hydrochloride | CHEMBL468915
Type:
Small organic molecule
Emp. Form.:
C17H20N2S
Mol. Mass.:
284.419
SMILES:
CNCCC[C@H](c1cccs1)c1cccc2[nH]ccc12
: