Target
Transporter
Ligand
BDBM50254027
Substrate
Meas. Tech.
ChEMBL_559243 (CHEMBL1014662)
Ki
95±n/a nM
Citation
 Manning, JRSexton, TChilders, SRDavies, HM 1-Naphthyl and 4-indolyl arylalkylamines as selective monoamine reuptake inhibitors. Bioorg Med Chem Lett 19:58-61 (2008)  
Target
Name:
Transporter
Synonyms:
NE transporter Norepinephrine transporter(NET)
Type:
Multi-pass membrane protein
Mol. Mass.:
69236.90
Organism:
Rattus norvegicus (rat)
Description:
Q63380
Residue:
617
  
Inhibitor
Name:
BDBM50254027
Synonyms:
(R)-3-(3,4-dichlorophenyl)-3-(1H-indol-4-yl)-N-methylpropan-1-amine hydrochloride | CHEMBL453520
Type:
Small organic molecule
Emp. Form.:
C18H18Cl2N2
Mol. Mass.:
333.255
SMILES:
CNCC[C@H](c1ccc(Cl)c(Cl)c1)c1cccc2[nH]ccc12
: