Target
Sodium-dependent dopamine transporter
Ligand
BDBM50370475
Substrate
Meas. Tech.
ChEMBL_560276 (CHEMBL1020454)
Ki
>2000±n/a nM
Citation
 Zeng, FMun, JJarkas, NStehouwer, JSVoll, RJTamagnan, GDHowell, LVotaw, JRKilts, CDNemeroff, CBGoodman, MM Synthesis, radiosynthesis, and biological evaluation of carbon-11 and fluorine-18 labeled reboxetine analogues: potential positron emission tomography radioligands for in vivo imaging of the norepinephrine transporter. J Med Chem 52:62-73 (2009)  
Target
Name:
Sodium-dependent dopamine transporter
Synonyms:
DA transporter DAT1 Dopamine transporter protein (DAT) SC6A3_HUMAN Sodium-dependent dopamine transporter Solute carrier family 6 member 3
Type:
Multi-pass membrane protein
Mol. Mass.:
68497.11
Organism:
Homo sapiens (Human)
Description:
Q01959
Residue:
620
  
Inhibitor
Name:
BDBM50370475
Synonyms:
S,S-REBOXETINE
Type:
Small organic molecule
Emp. Form.:
C19H23NO3
Mol. Mass.:
313.3908
SMILES:
CCOc1ccccc1O[C@H]([C@H]1CNCCO1)c1ccccc1
: