Target
Sodium-dependent serotonin transporter
Ligand
BDBM50370475
Substrate
Meas. Tech.
ChEMBL_560275 (CHEMBL1020453)
Ki
661±n/a nM
Citation
 Zeng, FMun, JJarkas, NStehouwer, JSVoll, RJTamagnan, GDHowell, LVotaw, JRKilts, CDNemeroff, CBGoodman, MM Synthesis, radiosynthesis, and biological evaluation of carbon-11 and fluorine-18 labeled reboxetine analogues: potential positron emission tomography radioligands for in vivo imaging of the norepinephrine transporter. J Med Chem 52:62-73 (2009)  
Target
Name:
Sodium-dependent serotonin transporter
Synonyms:
5-HT Transporter 5HTT SC6A4_HUMAN SLC6A4 Serotonin transporter (5HTT) Sodium-dependent serotonin transporter (SERT) | Solute carrier family 6 member 4
Type:
Multi-pass membrane protein
Mol. Mass.:
70322.51
Organism:
Homo sapiens (Human)
Description:
P31645
Residue:
630
  
Inhibitor
Name:
BDBM50370475
Synonyms:
S,S-REBOXETINE
Type:
Small organic molecule
Emp. Form.:
C19H23NO3
Mol. Mass.:
313.3908
SMILES:
CCOc1ccccc1O[C@H]([C@H]1CNCCO1)c1ccccc1
: