Target
Cannabinoid receptor 2
Ligand
BDBM50265616
Substrate
Meas. Tech.
ChEMBL_559547 (CHEMBL1019850)
Ki
89.9±n/a nM
Citation
 Diaz, PPhatak, SSXu, JAstruc-Diaz, FCavasotto, CNNaguib, M 6-Methoxy-N-alkyl isatin acylhydrazone derivatives as a novel series of potent selective cannabinoid receptor 2 inverse agonists: design, synthesis, and binding mode prediction. J Med Chem 52:433-44 (2009)  
Target
Name:
Cannabinoid receptor 2
Synonyms:
CANNABINOID CB2 CB2 CB2B CNR2_HUMAN Cannabinoid CB2 receptor Cannabinoid receptor 2 (CB2R) | hCB2
Type:
G Protein-Coupled Receptor (GPCR)
Mol. Mass.:
39690.94
Organism:
Homo sapiens (Human)
Description:
P34972
Residue:
360
  
Inhibitor
Name:
BDBM50265616
Synonyms:
CHEMBL497183 | N'-[(3Z)-1-Hexyl-6-methoxy-2-oxo-1,2-dihydro-3H-indol-3-ylidene]benzohydrazide
Type:
Small organic molecule
Emp. Form.:
C22H25N3O3
Mol. Mass.:
379.4522
SMILES:
CCCCCCN1C(=O)C(=NNC(=O)c2ccccc2)c2ccc(OC)cc12
: