Target
Fatty-acid amide hydrolase 1
Ligand
BDBM50204500
Substrate
Meas. Tech.
ChEMBL_494689 (CHEMBL938648)
Ki
40±n/a nM
Citation
 Seierstad, MBreitenbucher, JG Discovery and development of fatty acid amide hydrolase (FAAH) inhibitors. J Med Chem 51:7327-43 (2009)  
Target
Name:
Fatty-acid amide hydrolase 1
Synonyms:
Anandamide amidohydrolase FAAH FAAH1_HUMAN Fatty-acid amide hydrolase (FAAH) Oleamide hydrolase 1
Type:
Protein
Mol. Mass.:
63071.19
Organism:
Homo sapiens (Human)
Description:
O00519
Residue:
579
  
Inhibitor
Name:
BDBM50204500
Synonyms:
CHEMBL220005 | methyl 4-(2-(7-phenylheptanoyl)oxazol-5-yl)benzoate
Type:
Small organic molecule
Emp. Form.:
C24H25NO4
Mol. Mass.:
391.4596
SMILES:
COC(=O)c1ccc(cc1)-c1cnc(o1)C(=O)CCCCCCc1ccccc1
: