Target
Fatty-acid amide hydrolase 1
Ligand
BDBM50150484
Substrate
Meas. Tech.
ChEMBL_494689 (CHEMBL938648)
Ki
6000±n/a nM
Citation
 Seierstad, MBreitenbucher, JG Discovery and development of fatty acid amide hydrolase (FAAH) inhibitors. J Med Chem 51:7327-43 (2009)  
Target
Name:
Fatty-acid amide hydrolase 1
Synonyms:
Anandamide amidohydrolase FAAH FAAH1_HUMAN Fatty-acid amide hydrolase (FAAH) Oleamide hydrolase 1
Type:
Protein
Mol. Mass.:
63071.19
Organism:
Homo sapiens (Human)
Description:
O00519
Residue:
579
  
Inhibitor
Name:
BDBM50150484
Synonyms:
(Z)-9-octadecenoic acid CHEMBL8659 Octadec-9-enoic acid oleicacid
Type:
Small organic molecule
Emp. Form.:
C18H34O2
Mol. Mass.:
282.4614
SMILES:
CCCCCCCC\C=C/CCCCCCCC(O)=O
: