Target
Transient receptor potential cation channel subfamily V member 1
Ligand
BDBM50247754
Substrate
Meas. Tech.
ChEMBL_493861 (CHEMBL943269)
EC50
375±n/a nM
Citation
 Choi, HKChoi, SLee, YKang, DWRyu, HMaeng, HJChung, SJPavlyukovets, VAPearce, LVToth, ATran, RWang, YMorgan, MABlumberg, PMLee, J Non-vanillyl resiniferatoxin analogues as potent and metabolically stable transient receptor potential vanilloid 1 agonists. Bioorg Med Chem 17:690-8 (2009)  
Target
Name:
Transient receptor potential cation channel subfamily V member 1
Synonyms:
Capsaicin receptor TRPV1_RAT Trpv1 Vanilloid VR1 Vanilloid receptor 1 (VRI/TRPV1) Vanilloid receptor type 1-like (TrpV1/Vr1) Vr1l | osm-9-like TRP channel 1
Type:
Transient Receptor
Mol. Mass.:
94956.12
Organism:
Rattus norvegicus (rat)
Description:
O35433
Residue:
838
  
Inhibitor
Name:
BDBM50247754
Synonyms:
CHEMBL500075 | N-{[(1R,2R,6R,10S,11R,15S,17R)-13-benzyl-6-hydroxy-4,17-dimethyl-5-oxo-15-(prop-1-en-2-yl)-12,14,18-trioxapentacyclo[11.4.1.0^{1,10}.0^{2,6}.0^{11,15}]octadeca-3,8-dien-8-yl]methyl}-2-(4-methanesulfonamidophenyl)acetamide
Type:
Small organic molecule
Emp. Form.:
C37H42N2O8S
Mol. Mass.:
674.803
SMILES:
C[C@@H]1C[C@]2(OC3(Cc4ccccc4)O[C@@H]2[C@@H]2C=C(CNC(=O)Cc4ccc(NS(C)(=O)=O)cc4)C[C@@]4(O)[C@@H](C=C(C)C4=O)[C@@]12O3)C(C)=C
: