Target
Nitric oxide synthase, inducible
Ligand
BDBM50275563
Substrate
Meas. Tech.
ChEMBL_492858 (CHEMBL942189)
IC50
>50000±n/a nM
Citation
 Tsao, CCShen, YCSu, CRLi, CYLiou, MJDung, NXWu, TS New diterpenoids and the bioactivity of Erythrophleum fordii. Bioorg Med Chem 16:9867-70 (2008)  
Target
Name:
Nitric oxide synthase, inducible
Synonyms:
Inducible NO synthase Inducible nitric oxide synthase (iNOS) MAC-NOS NOS type II Nitric Oxide Synthase, inducible Nos2
Type:
Enzyme
Mol. Mass.:
130595.79
Organism:
Mus musculus (mouse)
Description:
Recombinant enzyme overexpressed in E. coli.
Residue:
1144
  
Inhibitor
Name:
BDBM50275563
Synonyms:
(+)-pinitol 1D-3-O-Methyl-chiro-inositol D-(+)-pinitol | Pinit
Type:
Small organic molecule
Emp. Form.:
C7H14O6
Mol. Mass.:
194.1825
SMILES:
CO[C@@H]1[C@@H](O)[C@@H](O)[C@H](O)[C@H](O)[C@H]1O
: