Target
Histamine H1 receptor
Ligand
BDBM86741
Substrate
Meas. Tech.
ChEMBL_493057 (CHEMBL953171)
Kd
2344.23±n/a nM
Citation
 Ghorai, PKraus, AKeller, MGötte, CIgel, PSchneider, ESchnell, DBernhardt, GDove, SZabel, MElz, SSeifert, RBuschauer, A Acylguanidines as bioisosteres of guanidines: NG-acylated imidazolylpropylguanidines, a new class of histamine H2 receptor agonists. J Med Chem 51:7193-204 (2009)  
Target
Name:
Histamine H1 receptor
Synonyms:
HISTAMINE H1 HRH1_CAVPO
Type:
G Protein-Coupled Receptor (GPCR)
Mol. Mass.:
55641.53
Organism:
Cavia porcellus (domestic guinea pig)
Description:
Guinea pig cerebellum was used in binding assay.
Residue:
488
  
Inhibitor
Name:
BDBM86741
Synonyms:
UR-AK59
Type:
Small organic molecule
Emp. Form.:
C16H27N5O
Mol. Mass.:
305.4185
SMILES:
CC(C1CCCCC1)C(=O)NC(N)=NCCCc1cnc[nH]1
: