Target
Dipeptidyl peptidase 8
Ligand
BDBM50221977
Substrate
Meas. Tech.
ChEMBL_541735 (CHEMBL1023097)
IC50
88±n/a nM
Citation
 Havale, SHPal, M Medicinal chemistry approaches to the inhibition of dipeptidyl peptidase-4 for the treatment of type 2 diabetes. Bioorg Med Chem 17:1783-802 (2009)  
Target
Name:
Dipeptidyl peptidase 8
Synonyms:
DPP8 DPRP-1 Dipeptidyl peptidase 8 (DPP-8) Dipeptidyl peptidase 8/9 Dipeptidyl peptidase VIII Prolyl dipeptidase DPP8
Type:
Enzyme
Mol. Mass.:
103342.62
Organism:
Homo sapiens (Human)
Description:
Q6V1X1
Residue:
898
  
Inhibitor
Name:
BDBM50221977
Synonyms:
(2S,3S)-2-amino-3-(4'-fluoro-biphenyl-4-yl)-1-((S)-3-fluoro-pyrrolidin-1-yl)-butan-1-one CHEMBL237336
Type:
Small organic molecule
Emp. Form.:
C20H22F2N2O
Mol. Mass.:
344.3983
SMILES:
C[C@H]([C@H](N)C(=O)N1CC[C@H](F)C1)c1ccc(cc1)-c1ccc(F)cc1
: