Target
Adenosine receptor A2b
Ligand
BDBM50256892
Substrate
Meas. Tech.
ChEMBL_566531 (CHEMBL955117)
Ki
>30000±n/a nM
Citation
 Lambertucci, CAntonini, IBuccioni, MDal Ben, DKachare, DDVolpini, RKlotz, KNCristalli, G 8-Bromo-9-alkyl adenine derivatives as tools for developing new adenosine A2A and A2B receptors ligands. Bioorg Med Chem 17:2812-22 (2009)  
Target
Name:
Adenosine receptor A2b
Synonyms:
AA2BR_HUMAN ADORA2B Adenosine receptors A2b | Adenosine receptors; A2a & A2b
Type:
G Protein-Coupled Receptor (GPCR)
Mol. Mass.:
36341.22
Organism:
Homo sapiens (Human)
Description:
Residue:
332
  
Inhibitor
Name:
BDBM50256892
Synonyms:
7-Propyl-7H-adenine | CHEMBL449108
Type:
Small organic molecule
Emp. Form.:
C8H11N5
Mol. Mass.:
177.2064
SMILES:
CCCn1cnc2ncnc(N)c12
: