Target
D(1A) dopamine receptor
Ligand
BDBM50378009
Substrate
Meas. Tech.
ChEMBL_563537 (CHEMBL961824)
Ki
>10000±n/a nM
Citation
 Newman, AHGrundt, PCyriac, GDeschamps, JRTaylor, MKumar, RHo, DLuedtke, RR N-(4-(4-(2,3-dichloro- or 2-methoxyphenyl)piperazin-1-yl)butyl)heterobiarylcarboxamides with functionalized linking chains as high affinity and enantioselective D3 receptor antagonists. J Med Chem 52:2559-70 (2009)  
Target
Name:
D(1A) dopamine receptor
Synonyms:
DA D1 receptor DRD1 Dopamine D1 receptor Dopamine D1A
Type:
Enzyme
Mol. Mass.:
49303.43
Organism:
Homo sapiens (Human)
Description:
P21728
Residue:
446
  
Inhibitor
Name:
BDBM50378009
Synonyms:
CHEMBL1627313
Type:
Small organic molecule
Emp. Form.:
C24H29IN4O3
Mol. Mass.:
548.4165
SMILES:
COc1ccccc1N1CCN(CC(O)CCNC(=O)c2cc3cc(I)ccc3[nH]2)CC1
: