Target
Heat shock protein HSP 90-beta
Ligand
BDBM15393
Substrate
Meas. Tech.
ChEMBL_543925 (CHEMBL1020360)
IC50
258±n/a nM
Citation
 Taldone, TSun, WChiosis, G Discovery and development of heat shock protein 90 inhibitors. Bioorg Med Chem 17:2225-35 (2009)  
Target
Name:
Heat shock protein HSP 90-beta
Synonyms:
HS90B_HUMAN HSP 90 HSP90B HSPCB Heat shock protein HSP 90 (Hsp90)
Type:
Molecular Chaperone
Mol. Mass.:
83229.45
Organism:
Homo sapiens (Human)
Description:
P08238
Residue:
724
  
Inhibitor
Name:
BDBM15393
Synonyms:
3-(5-chloro-2,4-dihydroxyphenyl)-N-(4-acetylphenyl)-1H-pyrazole-4-carboxamide CHEMBL200469
Type:
Small organic molecule
Emp. Form.:
C18H14ClN3O4
Mol. Mass.:
371.774
SMILES:
CC(=O)c1ccc(NC(=O)c2c[nH]nc2-c2cc(Cl)c(O)cc2O)cc1
: