Target
Phosphatidylinositol 4,5-bisphosphate 3-kinase catalytic subunit alpha isoform
Ligand
BDBM50265873
Substrate
Meas. Tech.
ChEMBL_540383 (CHEMBL1025726)
IC50
0.8±n/a nM
Citation
 Chamberlain, SDRedman, AMPatnaik, SBrickhouse, KChew, YCDeanda, FGerding, RLei, HMoorthy, GPatrick, MStevens, KLWilson, JWBrad Shotwell, J Optimization of a series of 4,6-bis-anilino-1H-pyrrolo[2,3-d]pyrimidine inhibitors of IGF-1R: elimination of an acid-mediated decomposition pathway. Bioorg Med Chem Lett 19:373-7 (2008)  
Target
Name:
Phosphatidylinositol 4,5-bisphosphate 3-kinase catalytic subunit alpha isoform
Synonyms:
P42336 PI3-kinase subunit p110-alpha PIK3CA Phosphatidylinositol 3-kinase alpha (PI3Kalpha) Phosphatidylinositol 4,5-bisphosphate 3-kinase (PI3K) Phosphatidylinositol 4,5-bisphosphate 3-kinase catalytic subunit alpha (PI3Kalpha) Phosphatidylinositol 4,5-bisphosphate 3-kinase catalytic subunit alpha isoform (PI3-Ka) Phosphatidylinositol 4,5-bisphosphate 3-kinase catalytic subunit alpha isoform (PI3K p110alpha) Phosphatidylinositol 4,5-bisphosphate 3-kinase catalytic subunit alpha isoform (PI3K-alpha) Phosphatidylinositol 4,5-bisphosphate 3-kinase catalytic subunit alpha isoform (PI3Kalpha p110alpha) Phosphatidylinositol 4,5-bisphosphate 3-kinase catalytic subunit alpha isoform (PIK3CA) Phosphatidylinositol-4,5-bisphosphate 3-kinase catalytic subunit alpha isoform Phosphoinositide 3-Kinase (PI3K), alpha Chain A Phosphoinositide 3-kinases (PI3K) PtdIns-3-kinase p110 | p110 alpha
Type:
Enzyme Subunit
Mol. Mass.:
124294.87
Organism:
Homo sapiens (Human)
Description:
P42336
Residue:
1068
  
Inhibitor
Name:
BDBM50265873
Synonyms:
7-(2-(1-(2-(dimethylamino)acetyl)-5-methoxyindolin-6-ylamino)-7H-pyrrolo[2,3-d]pyrimidin-4-ylamino)isoindolin-1-one | CHEMBL517163
Type:
Small organic molecule
Emp. Form.:
C27H28N8O3
Mol. Mass.:
512.563
SMILES:
COc1cc2CCN(C(=O)CN(C)C)c2cc1Nc1nc(Nc2cccc3CNC(=O)c23)c2cc[nH]c2n1
: