Target
Insulin-like growth factor 1 receptor
Ligand
BDBM27841
Substrate
Meas. Tech.
ChEMBL_540379 (CHEMBL1025722)
IC50
0.8±n/a nM
Citation
 Chamberlain, SDRedman, AMPatnaik, SBrickhouse, KChew, YCDeanda, FGerding, RLei, HMoorthy, GPatrick, MStevens, KLWilson, JWBrad Shotwell, J Optimization of a series of 4,6-bis-anilino-1H-pyrrolo[2,3-d]pyrimidine inhibitors of IGF-1R: elimination of an acid-mediated decomposition pathway. Bioorg Med Chem Lett 19:373-7 (2008)  
Target
Name:
Insulin-like growth factor 1 receptor
Synonyms:
CD_antigen=CD221 IGF1R Insulin-like growth factor 1 receptor (IGF1R) Insulin-like growth factor 1 receptor alpha chain Insulin-like growth factor I receptor | Insulin-like growth factor receptor (IGFR)
Type:
Protein
Mol. Mass.:
154776.79
Organism:
Homo sapiens (Human)
Description:
P08069
Residue:
1367
  
Inhibitor
Name:
BDBM27841
Synonyms:
2,4-difluoro-6-{[2-({2-methoxy-4-[4-(propan-2-yl)piperazin-1-yl]phenyl}amino)-7H-pyrrolo[2,3-d]pyrimidin-4-yl]amino}benzamide CHEMBL464971
Type:
Small organic molecule
Emp. Form.:
C27H30F2N8O2
Mol. Mass.:
536.5763
SMILES:
COc1cc(ccc1Nc1nc(Nc2cc(F)cc(F)c2C(N)=O)c2cc[nH]c2n1)N1CCN(CC1)C(C)C
: