Target
Melanocortin receptor 5
Ligand
BDBM50268794
Substrate
Meas. Tech.
ChEMBL_523579 (CHEMBL997229)
EC50
<0.1±n/a nM
Comments
Zero 20220115
Citation
 Qu, HCai, MMayorov, AVGrieco, PZingsheim, MTrivedi, DHruby, VJ Substitution of arginine with proline and proline derivatives in melanocyte-stimulating hormones leads to selectivity for human melanocortin 4 receptor. J Med Chem 52:3627-35 (2009)  
Target
Name:
Melanocortin receptor 5
Synonyms:
MC-2 MC5R Melanocortin MC5 Melanocortin receptor 5 | Melanocortin receptor 5 (MC5R)
Type:
Enzyme
Mol. Mass.:
36612.92
Organism:
Homo sapiens (Human)
Description:
P33032
Residue:
325
  
Inhibitor
Name:
BDBM50268794
Synonyms:
Ac-Nle-c[Asp-His-DPhe-cis-4-guanidinyl-Pro-Trp-Lys]-NH2 | CHEMBL444493
Type:
Small organic molecule
Emp. Form.:
C50H67N15O9
Mol. Mass.:
1022.1621
SMILES:
CCCC[C@H](NC(C)=O)C(=O)N[C@H]1CC(=O)NCCCC[C@H](NC(=O)[C@H](Cc2c[nH]c3ccccc23)NC(=O)[C@H]2C[C@@H](CN2C(=O)[C@@H](Cc2ccccc2)NC(=O)[C@H](Cc2cnc[nH]2)NC1=O)N=C(N)N)C(N)=O
: