Target
Vascular endothelial growth factor receptor 2
Ligand
BDBM50279121
Substrate
Meas. Tech.
ChEMBL_545066 (CHEMBL1017182)
IC50
2112±n/a nM
Citation
 Roth, GJHeckel, AColbatzky, FHandschuh, SKley, JLehmann-Lintz, TLotz, RTontsch-Grunt, UWalter, RHilberg, F Design, synthesis, and evaluation of indolinones as triple angiokinase inhibitors and the discovery of a highly specific 6-methoxycarbonyl-substituted indolinone (BIBF 1120). J Med Chem 52:4466-80 (2009)  
Target
Name:
Vascular endothelial growth factor receptor 2
Synonyms:
CD_antigen=CD309 Fetal liver kinase 1 (FLK-1) KDR Protein-tyrosine kinase receptor Flk-1 VEGFR-2 VEGFR2 Vascular Endothelial Growth Factor Receptor Kinase 2 Vascular endothelial growth factor receptor 2 (KDR) Vascular endothelial growth factor receptor 2 (VEGFR2) Vascular endothelial growth factor receptor-2 (VEGFR-2)
Type:
Receptor Tyrosine Kinase
Mol. Mass.:
151510.97
Organism:
Homo sapiens (Human)
Description:
P35968
Residue:
1356
  
Inhibitor
Name:
BDBM50279121
Synonyms:
(Z)-3-[Phenyl-(4-piperidin-1-ylmethyl-phenylamino)-methylene]-indolin-2-one | CHEMBL500435
Type:
Small organic molecule
Emp. Form.:
C27H27N3O
Mol. Mass.:
409.5228
SMILES:
O=C1Nc2ccccc2C1C(=Nc1ccc(CN2CCCCC2)cc1)c1ccccc1
: