Target
Potassium voltage-gated channel subfamily H member 2
Ligand
BDBM50099260
Substrate
Meas. Tech.
ChEMBL_545772 (CHEMBL1027667)
Ki
1100±n/a nM
Citation
 Zachariae, UGiordanetto, FLeach, AG Side chain flexibilities in the human ether-a-go-go related gene potassium channel (hERG) together with matched-pair binding studies suggest a new binding mode for channel blockers. J Med Chem 52:4266-76 (2009)  
Target
Name:
Potassium voltage-gated channel subfamily H member 2
Synonyms:
1,3-beta-glucan synthase component GLS2 ERG Eag-related protein 1 Ether-a-go-go-related gene (HERG) Ether-a-go-go-related gene potassium channel 1 Ether-a-go-go-related gene potassium channel 1 (hERG1) Ether-a-go-go-related protein 1 H-ERG KCNH2 Potassium voltage-gated channel subfamily H member 2 (hERG) Voltage-gated potassium channel subunit Kv11.1 hERG Potassium Channel 1 | putative potassium channel subunit
Type:
Multi-pass membrane protein
Mol. Mass.:
126672.65
Organism:
Homo sapiens (Human)
Description:
Q12809
Residue:
1159
  
Inhibitor
Name:
BDBM50099260
Synonyms:
3-(4-Fluoro-piperidin-3-yl)-2-phenyl-1H-indole | CHEMBL41767
Type:
Small organic molecule
Emp. Form.:
C19H19FN2
Mol. Mass.:
294.366
SMILES:
F[C@@H]1CCNCC1c1c([nH]c2ccccc12)-c1ccccc1
: