Target
Renin
Ligand
BDBM50259459
Substrate
Meas. Tech.
ChEMBL_501175 (CHEMBL975288)
IC50
0.55±n/a nM
Citation
 Bezençon, OBur, DWeller, TRichard-Bildstein, SRemen, LSifferlen, TCorminboeuf, OGrisostomi, CBoss, CPrade, LDelahaye, STreiber, AStrickner, PBinkert, CHess, PSteiner, BFischli, W Design and preparation of potent, nonpeptidic, bioavailable renin inhibitors. J Med Chem 52:3689-702 (2009)  
Target
Name:
Renin
Synonyms:
Angiotensinogenase RENI_HUMAN
Type:
Enzyme
Mol. Mass.:
45058.99
Organism:
Homo sapiens (Human)
Description:
Residue:
406
  
Inhibitor
Name:
BDBM50259459
Synonyms:
(rac)-(1RS,5SR)-3-(3-Carbamoyl-propionyl)-7-{4-[3-(2,3,6-trifluoro-phenoxy)-propyl]-phenyl}-3,9-diaza-bicyclo[3.3.1]non-6-ene-6-carboxylic acid(2-chloro-benzyl)-cyclopropyl-amide | CHEMBL448175
Type:
Small organic molecule
Emp. Form.:
C37H38ClF3N4O4
Mol. Mass.:
695.17
SMILES:
NC(=O)CCC(=O)N1CC2CC(=C(C(C1)N2)C(=O)N(Cc1ccccc1Cl)C1CC1)c1ccc(CCCOc2c(F)ccc(F)c2F)cc1
: