Target
Renin
Ligand
BDBM50259443
Substrate
Meas. Tech.
ChEMBL_501175 (CHEMBL975288)
IC50
0.48±n/a nM
Citation
 Bezençon, OBur, DWeller, TRichard-Bildstein, SRemen, LSifferlen, TCorminboeuf, OGrisostomi, CBoss, CPrade, LDelahaye, STreiber, AStrickner, PBinkert, CHess, PSteiner, BFischli, W Design and preparation of potent, nonpeptidic, bioavailable renin inhibitors. J Med Chem 52:3689-702 (2009)  
Target
Name:
Renin
Synonyms:
Angiotensinogenase RENI_HUMAN
Type:
Enzyme
Mol. Mass.:
45058.99
Organism:
Homo sapiens (Human)
Description:
Residue:
406
  
Inhibitor
Name:
BDBM50259443
Synonyms:
(1R,5S)-3-Acetyl-7-{4-[3-(2,3,6-trifluoro-phenoxy)-propyl]-phenyl}-3,9-diaza-bicyclo[3.3.1]non-6-ene-6-carboxylic acid cyclopropyl-(2,3-dichloro-benzyl)-amide | CHEMBL444146
Type:
Small organic molecule
Emp. Form.:
C35H34Cl2F3N3O3
Mol. Mass.:
672.564
SMILES:
CC(=O)N1C[C@H]2CC(=C([C@@H](C1)N2)C(=O)N(Cc1cccc(Cl)c1Cl)C1CC1)c1ccc(CCCOc2c(F)ccc(F)c2F)cc1
: