Target
Renin
Ligand
BDBM50259431
Substrate
Meas. Tech.
ChEMBL_501175 (CHEMBL975288)
IC50
0.25±n/a nM
Citation
 Bezençon, OBur, DWeller, TRichard-Bildstein, SRemen, LSifferlen, TCorminboeuf, OGrisostomi, CBoss, CPrade, LDelahaye, STreiber, AStrickner, PBinkert, CHess, PSteiner, BFischli, W Design and preparation of potent, nonpeptidic, bioavailable renin inhibitors. J Med Chem 52:3689-702 (2009)  
Target
Name:
Renin
Synonyms:
Angiotensinogenase RENI_HUMAN
Type:
Enzyme
Mol. Mass.:
45058.99
Organism:
Homo sapiens (Human)
Description:
Residue:
406
  
Inhibitor
Name:
BDBM50259431
Synonyms:
(1R,5S)-3-Acetyl-7-{4-[3-(2-methoxy-benzyloxy)-propoxy]-phenyl}-3,9-diaza-bicyclo[3.3.1]non-6-ene-6-carboxylic acid cyclopropyl-(2,3-dimethyl-benzyl)-amide | CHEMBL443192
Type:
Small organic molecule
Emp. Form.:
C39H47N3O5
Mol. Mass.:
637.8076
SMILES:
COc1ccccc1COCCCOc1ccc(cc1)C1=C([C@H]2CN(C[C@@H](C1)N2)C(C)=O)C(=O)N(Cc1cccc(C)c1C)C1CC1
: