Target
Renin
Ligand
BDBM50259418
Substrate
Meas. Tech.
ChEMBL_501175 (CHEMBL975288)
IC50
1±n/a nM
Citation
 Bezençon, OBur, DWeller, TRichard-Bildstein, SRemen, LSifferlen, TCorminboeuf, OGrisostomi, CBoss, CPrade, LDelahaye, STreiber, AStrickner, PBinkert, CHess, PSteiner, BFischli, W Design and preparation of potent, nonpeptidic, bioavailable renin inhibitors. J Med Chem 52:3689-702 (2009)  
Target
Name:
Renin
Synonyms:
Angiotensinogenase RENI_HUMAN
Type:
Enzyme
Mol. Mass.:
45058.99
Organism:
Homo sapiens (Human)
Description:
Residue:
406
  
Inhibitor
Name:
BDBM50259418
Synonyms:
(1R,5S)-3-[2-(4-Chloro-phenyl)-acetyl]-7{4-[3-(2-methoxy-benzyloxy)-propoxy]-phenyl}-3,9-diaza-bicyclo[3.3.1]non-6-ene-6-carboxylic acid(2-chloro-benzyl)-methyl-amide | CHEMBL508158
Type:
Small organic molecule
Emp. Form.:
C41H43Cl2N3O5
Mol. Mass.:
728.703
SMILES:
COc1ccccc1COCCCOc1ccc(cc1)C1=C([C@H]2CN(C[C@@H](C1)N2)C(=O)Cc1ccc(Cl)cc1)C(=O)N(C)Cc1ccccc1Cl
: