Target
Glucocorticoid receptor
Ligand
BDBM50294151
Substrate
Meas. Tech.
ChEMBL_571702 (CHEMBL1032150)
IC50
22±n/a nM
Citation
 Liu, BKodadek, T Investigation of the relative cellular permeability of DNA-binding pyrrole-imidazole polyamides. J Med Chem 52:4604-12 (2009)  
Target
Name:
Glucocorticoid receptor
Synonyms:
GCR_HUMAN GRL Glucocorticoid receptor (GRFP) Nuclear receptor subfamily 3 group C member 1
Type:
Enzyme
Mol. Mass.:
85656.87
Organism:
Homo sapiens (Human)
Description:
P04150
Residue:
777
  
Inhibitor
Name:
BDBM50294151
Synonyms:
CHEMBL552769 | N-(5-(4-(5-(5-(5-(5-(1-((8S,9R,10S,11S,13S,14S,16R,17R)-9-fluoro-11,17-dihydroxy-10,13,16-trimethyl-3-oxo-6,7,8,9,10,11,12,13,14,15,16,17-dodecahydro-3H-cyclopenta[a]phenanthren-17-yl)-12-methyl-1,17-dioxo-7-thioxo-3-thia-6,8,12,16-tetraazanonadecan-19-ylcarbamoyl)-1-methyl-1H-pyrrol-3-ylcarbamoyl)-1-methyl-1H-pyrrol-3-ylcarbamoyl)-1-methyl-1H-pyrrol-3-ylcarbamoyl)-1-methyl-1H-pyrrol-3-ylamino)-4-oxobutylcarbamoyl)-1-methyl-1H-pyrrol-3-yl)-1-methyl-1H-imidazole-2-carboxamide
Type:
Small organic molecule
Emp. Form.:
C74H97FN18O12S2
Mol. Mass.:
1513.804
SMILES:
C[C@@H]1C[C@H]2[C@@H]3CCC4=CC(=O)C=C[C@]4(C)[C@@]3(F)[C@@H](O)C[C@]2(C)[C@@]1(O)C(=O)CSCCNC(=S)NCCCN(C)CCCNC(=O)CCNC(=O)c1cc(NC(=O)c2cc(NC(=O)c3cc(NC(=O)c4cc(NC(=O)CCCNC(=O)c5cc(NC(=O)c6nccn6C)cn5C)cn4C)cn3C)cn2C)cn1C
: