Target
Cytochrome P450 2D6
Ligand
BDBM50295551
Substrate
Meas. Tech.
ChEMBL_580019 (CHEMBL1051707)
IC50
>10000±n/a nM
Citation
 Shen, HCDing, FXWang, SDeng, QZhang, XChen, YZhou, GXu, SChen, HSTong, XTong, VMitra, KKumar, STsai, CStevenson, ASPai, LYAlonso-Galicia, MChen, XSoisson, SMRoy, SZhang, BTata, JRBerger, JPColletti, SL Discovery of a highly potent, selective, and bioavailable soluble epoxide hydrolase inhibitor with excellent ex vivo target engagement. J Med Chem 52:5009-12 (2010)  
Target
Name:
Cytochrome P450 2D6
Synonyms:
CP2D6_HUMAN CYP2DL1 Cytochrome P450 2D6 (CYP2D6) P450-DB1
Type:
Protein
Mol. Mass.:
55774.82
Organism:
Homo sapiens (Human)
Description:
P10635
Residue:
497
  
Inhibitor
Name:
BDBM50295551
Synonyms:
CHEMBL564975 | N-(2-phenylcyclopropyl)-4-(1H-1,2,3-triazol-1-yl)piperidine-1-carboxamide
Type:
Small organic molecule
Emp. Form.:
C17H21N5O
Mol. Mass.:
311.3815
SMILES:
O=C(NC1CC1c1ccccc1)N1CCC(CC1)n1ccnn1
: