Target
Bifunctional epoxide hydrolase 2
Ligand
BDBM25737
Substrate
Meas. Tech.
ChEMBL_580014 (CHEMBL1051702)
IC50
1.6±n/a nM
Citation
 Shen, HCDing, FXWang, SDeng, QZhang, XChen, YZhou, GXu, SChen, HSTong, XTong, VMitra, KKumar, STsai, CStevenson, ASPai, LYAlonso-Galicia, MChen, XSoisson, SMRoy, SZhang, BTata, JRBerger, JPColletti, SL Discovery of a highly potent, selective, and bioavailable soluble epoxide hydrolase inhibitor with excellent ex vivo target engagement. J Med Chem 52:5009-12 (2010)  
Target
Name:
Bifunctional epoxide hydrolase 2
Synonyms:
Cytosolic epoxide hydrolase 2 EPHX2 HYES_HUMAN Soluble epoxide hydrolase (sEH) | epoxide hydrolase 2, cytoplasmic
Type:
Enzyme
Mol. Mass.:
62613.07
Organism:
Homo sapiens (Human)
Description:
P34913
Residue:
555
  
Inhibitor
Name:
BDBM25737
Synonyms:
12-[(adamantan-1-ylcarbamoyl)amino]dodecanoic acid US10383835, Compound 700 | Urea-based compound, 18
Type:
Small organic molecule
Emp. Form.:
C23H40N2O3
Mol. Mass.:
392.5753
SMILES:
OC(=O)CCCCCCCCCCCNC(=O)NC12CC3CC(CC(C3)C1)C2
: