Target
Cathepsin D
Ligand
BDBM50302846
Substrate
Meas. Tech.
ChEMBL_595447 (CHEMBL1045212)
IC50
3.3±n/a nM
Citation
 Sealy, JMTruong, APTso, LProbst, GDAquino, JHom, RKJagodzinska, BMDressen, DWone, DWBrogley, LJohn, VTung, JSPleiss, MATucker, JAKonradi, AWDappen, MSToth, GPan, HRuslim, LMiller, JBova, MPSinha, SQuinn, KPSauer, JM Design and synthesis of cell potent BACE-1 inhibitors: structure-activity relationship of P1' substituents. Bioorg Med Chem Lett 19:6386-91 (2009)  
Target
Name:
Cathepsin D
Synonyms:
CATD_HUMAN CTSD Cathepsin D heavy chain Cathepsin D precursor
Type:
Enzyme
Mol. Mass.:
44551.72
Organism:
Homo sapiens (Human)
Description:
Human proCathepsin D (SwissProt accession number P07339) was expressed in Sf9 cells, purified, and autoactivated.
Residue:
412
  
Inhibitor
Name:
BDBM50302846
Synonyms:
CHEMBL570165 | benzyl 3-((2R,3S)-3-acetamido-4-(3,5-difluorophenyl)-2-hydroxybutylamino)-3-(3-tert-butylphenyl)piperidine-1-carboxylate
Type:
Small organic molecule
Emp. Form.:
C35H43F2N3O4
Mol. Mass.:
607.7304
SMILES:
CC(=O)N[C@@H](Cc1cc(F)cc(F)c1)[C@H](O)CNC1(CCCN(C1)C(=O)OCc1ccccc1)c1cccc(c1)C(C)(C)C
: