Target
Vascular endothelial growth factor receptor 3
Ligand
BDBM13530
Substrate
Meas. Tech.
ChEMBL_587184 (CHEMBL1060246)
Kd
>10000±n/a nM
Citation
 Karaman, MWHerrgard, STreiber, DKGallant, PAtteridge, CECampbell, BTChan, KWCiceri, PDavis, MIEdeen, PTFaraoni, RFloyd, MHunt, JPLockhart, DJMilanov, ZVMorrison, MJPallares, GPatel, HKPritchard, SWodicka, LMZarrinkar, PP A quantitative analysis of kinase inhibitor selectivity. Nat Biotechnol 26:127-32 (2008)  
Target
Name:
Vascular endothelial growth factor receptor 3
Synonyms:
FLT-4 Fms-like tyrosine kinase 4 VEGFR-3 VGFR3_HUMAN Vascular endothelial growth factor receptor 3 (VEGFR-3) | Vascular endothelial growth factor receptor 3 (VEGFR3)
Type:
Protein
Mol. Mass.:
152749.58
Organism:
Homo sapiens (Human)
Description:
P35916-2
Residue:
1363
  
Inhibitor
Name:
BDBM13530
Synonyms:
4-[(4-methylpiperazin-1-yl)methyl]-N-[4-methyl-3-[(4-pyridin-3-ylpyrimidin-2-yl)amino]phenyl]benzamide Gleevec Imatinib, 21 STI-571 US10906896, Cpd imatinib US11725005, Compound imatinib cid_5291 med.21724, Compound 6
Type:
Small organic molecule
Emp. Form.:
C29H31N7O
Mol. Mass.:
493.6027
SMILES:
CN1CCN(Cc2ccc(cc2)C(=O)Nc2ccc(C)c(Nc3nccc(n3)-c3cccnc3)c2)CC1
: