Target
Interferon-induced, double-stranded RNA-activated protein kinase
Ligand
BDBM13216
Substrate
Meas. Tech.
ChEMBL_586721 (CHEMBL1062867)
Kd
>10000±n/a nM
Citation
 Karaman, MWHerrgard, STreiber, DKGallant, PAtteridge, CECampbell, BTChan, KWCiceri, PDavis, MIEdeen, PTFaraoni, RFloyd, MHunt, JPLockhart, DJMilanov, ZVMorrison, MJPallares, GPatel, HKPritchard, SWodicka, LMZarrinkar, PP A quantitative analysis of kinase inhibitor selectivity. Nat Biotechnol 26:127-32 (2008)  
Target
Name:
Interferon-induced, double-stranded RNA-activated protein kinase
Synonyms:
E2AK2_HUMAN Eukaryotic translation initiation factor 2-alpha kinase 2 P1/eIF-2A protein kinase PRKR Protein kinase RNA-activated eIF-2A protein kinase 2 | p68 kinase
Type:
PROTEIN
Mol. Mass.:
62104.61
Organism:
Homo sapiens (Human)
Description:
ChEMBL_1467743
Residue:
551
  
Inhibitor
Name:
BDBM13216
Synonyms:
BMS-354825 DASATINIB N-(2-chloro-6-methylphenyl)-2-({6-[4-(2-hydroxyethyl)piperazin-1-yl]-2-methylpyrimidin-4-yl}amino)-1,3-thiazole-5-carboxamide US20230348453, Compound A8 med.21724, Compound Dasatinib
Type:
Small organic molecule
Emp. Form.:
C22H26ClN7O2S
Mol. Mass.:
488.006
SMILES:
Cc1nc(Nc2ncc(s2)C(=O)Nc2c(C)cccc2Cl)cc(n1)N1CCN(CCO)CC1
: