Target
Inhibitor of nuclear factor kappa-B kinase subunit epsilon
Ligand
BDBM13534
Substrate
Meas. Tech.
ChEMBL_586823 (CHEMBL1050835)
Kd
2600±n/a nM
Citation
 Karaman, MWHerrgard, STreiber, DKGallant, PAtteridge, CECampbell, BTChan, KWCiceri, PDavis, MIEdeen, PTFaraoni, RFloyd, MHunt, JPLockhart, DJMilanov, ZVMorrison, MJPallares, GPatel, HKPritchard, SWodicka, LMZarrinkar, PP A quantitative analysis of kinase inhibitor selectivity. Nat Biotechnol 26:127-32 (2008)  
Target
Name:
Inhibitor of nuclear factor kappa-B kinase subunit epsilon
Synonyms:
I kappa-B kinase epsilon I-kappa-B kinase epsilon (IKK-E) IKBKE IKK-epsilon IKKE IKKI KIAA0151 | von Hippel-Lindau disease tumor suppressor/Inhibitor of nuclear factor kappa-B kinase subunit epsilon
Type:
Serine/threonine-protein kinase
Mol. Mass.:
80475.98
Organism:
Homo sapiens (Human)
Description:
Kinase inhibitory activity was determined using recombinant human IKK-epsilon expressed in baculovirus as a FLAG-tagged fusion protein.
Residue:
716
  
Inhibitor
Name:
BDBM13534
Synonyms:
CHEMBL572878 N-[4-[[4-(4-methylpiperazino)-6-[(5-methyl-1H-pyrazol-3-yl)amino]pyrimidin-2-yl]thio]phenyl]cyclopropanecarboxamide VX680 | cyclopropane carboxylic acid {4-[4-(4-methyl-piperazin-1-yl)-6-(5-methyl-2H-pyrazol-3-ylamino)-pyrimidin-2ylsulphanyl]-phenyl}-amide
Type:
Small organic molecule
Emp. Form.:
C23H28N8OS
Mol. Mass.:
464.586
SMILES:
CN1CCN(CC1)c1cc(Nc2cc(C)n[nH]2)nc(Sc2ccc(NC(=O)C3CC3)cc2)n1
: