Target
Aurora kinase C
Ligand
BDBM13216
Substrate
Meas. Tech.
ChEMBL_587172 (CHEMBL1060236)
Kd
>10000±n/a nM
Citation
 Karaman, MWHerrgard, STreiber, DKGallant, PAtteridge, CECampbell, BTChan, KWCiceri, PDavis, MIEdeen, PTFaraoni, RFloyd, MHunt, JPLockhart, DJMilanov, ZVMorrison, MJPallares, GPatel, HKPritchard, SWodicka, LMZarrinkar, PP A quantitative analysis of kinase inhibitor selectivity. Nat Biotechnol 26:127-32 (2008)  
Target
Name:
Aurora kinase C
Synonyms:
AIE2 AIRK3 AURKC Aurora Kinase C (Aurora-C) Aurora kinase C (AURKC) Aurora-C/INCENP Aurora/Ipl1/Eg2 protein 2 Serine/threonine-protein kinase 13 | Serine/threonine-protein kinase Aurora-C
Type:
Enzyme
Mol. Mass.:
35602.43
Organism:
Homo sapiens (Human)
Description:
Amino acid residues 1-309 were expressed as His-tagged fusion protein using baculovirus expression system.
Residue:
309
  
Inhibitor
Name:
BDBM13216
Synonyms:
BMS-354825 DASATINIB N-(2-chloro-6-methylphenyl)-2-({6-[4-(2-hydroxyethyl)piperazin-1-yl]-2-methylpyrimidin-4-yl}amino)-1,3-thiazole-5-carboxamide US20230348453, Compound A8 med.21724, Compound Dasatinib
Type:
Small organic molecule
Emp. Form.:
C22H26ClN7O2S
Mol. Mass.:
488.006
SMILES:
Cc1nc(Nc2ncc(s2)C(=O)Nc2c(C)cccc2Cl)cc(n1)N1CCN(CCO)CC1
: